{"text_format":"1","workbook":"xlsx","n_sheets":8,"sheets":["DISCLAIMER","Instrucciones","DATOS","Flujo de caja","Calculo(rehabilitado)","Calculo(inicial)","LOCALIDADES","LIMITES"],"not_rendered":{"charts":0,"images":16,"macros":0,"external_links":1,"defined_names":5,"comments":0,"pivot_tables":0},"unopened":[],"bounds":{"document_bytes":16777216,"sheet_cells":100000,"rows_first":2000,"rows_last":500,"rows_between":2000,"halvings":0,"cell_chars":16384,"cell_head_chars":4096},"cells_cut":0,"cells_raw":0,"read":"whole","date_system":"1900"}

{"sheet":"DISCLAIMER","index":0,"n_rows":6,"n_cols":1,"rows_kept":6,"cut":false,"hidden":false,"merged":[]}
["DISCLAIMER / DESCARGO DE RESPONABILIDAD"]
["El objeto de esta herramienta es efectuar un estudio preliminar sobre el impacto de la rehabilitación en un edificio de viviendas."]
["No es pues una herramienta para ser utilizada en fase de proyecto definitivo de rehabilitación y tampoco una herramienta para efectuar las verificaciones reglamentarias que puedan ser legalmente exigibles"]
["La información proporcionada por la herramienta se ofrece a título estimativo como ayuda al usuario o propietario del edificio o vivienda, pero ni es ni puede sustituir al conjunto de cálculos y comprobaciones que la dirección técnica del proyecto de rehabilitación energética deberá llevar a cabo para justificar el cumplimiento de la reglamentación técnica vigente y de aplicación al proyecto, como puede ser la reglamentaria certificación energética del edificio o vivienda. "]
["Los diferentes niveles de rehabilitación (\"mínima\", \"estándar\" y \"elevada\") sirven para realizar cálculos orientativos, pero no implican el cumplimiento con el Código Técnico de Edificación que deberá ser siempre evaluado por la dirección técnica del proyecto. "]
["El estudio proporcionado sobre el cumplimiento con las subvenciones es orientativo y se deberá verificar en cada Comunidad Autónoma por un técnico designado a tal fin."]

{"sheet":"Instrucciones","index":1,"n_rows":392,"n_cols":3,"rows_kept":392,"cut":false,"hidden":false,"merged":[[298,1,298,2],[386,1,386,2],[0,1,0,3]]}
[null,"INSTRUCCIONES HERRAMIENTA ESTUDIO PRELIMINAR REHABILITACION"]
[]
[]
[]
[]
[]
[]
[]
[]
[]
{"$rows_left_out":383}
{"sheet":"DATOS","index":2,"n_rows":126,"n_cols":12,"rows_kept":126,"cut":false,"hidden":false,"merged":[[100,1,100,2],[99,1,99,2],[101,3,101,4],[1,1,1,10],[84,1,84,10],[50,8,50,9],[2,2,2,9],[88,1,88,10],[39,2,39,8],[61,2,61,8],[29,2,29,9],[97,1,97,10],[86,2,86,4],[85,2,85,4],[3,2,3,9],[15,2,15,9],[123,1,123,10],[124,1,124,10],[125,1,125,10],[120,1,120,10],[13,3,13,6],[23,1,23,2],[23,4,23,7],[24,2,24,9],[85,8,85,9],[37,2,37,9],[30,2,30,9],[14,6,14,9],[31,1,31,10],[25,1,25,10],[36,2,36,9],[118,2,118,8],[102,3,102,4],[103,3,103,4],[101,1,101,2],[121,1,121,10],[122,1,122,10],[115,2,116,8],[104,1,104,10],[109,1,109,10]]}
[]
[null,"ESTUDIO PRELIMINAR REHABILITACIÓN ENERGÉTICA VIVIENDAS"]
[null,"Nombre del proyecto","Edificio plurifamiliar entre medianeras"]
[null,null,"Información del edificio"]
[null,"Ciudad referencia",null,null,null,"Zona Climática",{"$f":"INDEX(LOCALIDADES!BV3:BV59,'Calculo(rehabilitado)'!C2)","v":"C2"}]
[null,"Superficie Útil",{"$f":"159*4","v":636},"m2","Número Viviendas",8]
[null,"Altura entre plantas",3,"m"]
[null,"Situación Inicial",1]
[null,null,"Fachada\nSur","Fachada\nSur Este","Fachada\nEste","Fachada\nNorte","Fachada\nOeste","Fachada\nSur Oeste","Azoteas\nTejados","Cerramientos exteriores\nNo soleados"]
[null,"Superficie (bruta)",145.5,null,null,145.5,null,null,15.16,297.60000000000002,"m2"]
{"$rows_left_out":117}
{"sheet":"Flujo de caja","index":3,"n_rows":54,"n_cols":11,"rows_kept":54,"cut":false,"hidden":true,"merged":[[1,1,1,3],[1,4,1,6],[6,7,6,10],[3,7,3,10]]}
[null,null,null,null,null,null,null,"Periodo",50,"años"]
[null,"Sin subvenciones",null,null,"Con Subvenciones",null,null,"Interes referencia",1,"%"]
["años","reales","aislamiento","estimado","reales","aislamiento","estimado",null,{"$f":"I2/100","v":0.01},"(0-1)"]
[0,{"$f":"-DATOS!F94","v":-112412.72280057144},{"$f":"-DATOS!H94","v":-10290.02960057143},{"$f":"-DATOS!I94","v":-112412.72280057144},{"$f":"B4+DATOS!F102","v":-39344.452980200003},{"$f":"C4+DATOS!H102","v":-10290.02960057143},{"$f":"D4+DATOS!I102","v":-112412.72280057144},"Sin subvencion"]
[1,{"$f":"DATOS!F97","v":3338.7625688777034},{"$f":"DATOS!F97","v":3338.7625688777034},{"$f":"DATOS!F97","v":3338.7625688777034},{"$f":"DATOS!F97","v":3338.7625688777034},{"$f":"DATOS!F97","v":3338.7625688777034},{"$f":"DATOS!F97","v":3338.7625688777034},"TIR",{"$f":"IRR(B4:B54,0.01)","v":1.6769667065211324E-2},{"$f":"IRR(C4:C54,0.01)","v":0.32446553205292838},{"$f":"IRR(D4:D54,0.01)","v":1.6769667065211324E-2}]
[2,{"$f":"B5","v":3338.7625688777034},3338.7625688777034,3338.7625688777034,3338.7625688777034,3338.7625688777034,3338.7625688777034,"VAN",{"$f":"NPV(I3,B5:B54)+B4","v":18453.807257613153},{"$f":"NPV(I3,C5:C54)+C4","v":120576.50045761316},{"$f":"NPV(I3,D5:D54)+D4","v":18453.807257613153}]
[3,{"$f":"B6","v":3338.7625688777034},{"$f":"C6","v":3338.7625688777034},{"$f":"D6","v":3338.7625688777034},3338.7625688777034,3338.7625688777034,3338.7625688777034,"Con Subvencion"]
[4,3338.7625688777034,3338.7625688777034,3338.7625688777034,3338.7625688777034,3338.7625688777034,3338.7625688777034,"TIR",{"$f":"IRR(E4:E54,0.01)","v":8.3306969541680376E-2},{"$f":"IRR(F4:F54,0.01)","v":0.32446553205292838},{"$f":"IRR(G4:G54,0.01)","v":1.6769667065211324E-2}]
[5,3338.7625688777034,3338.7625688777034,3338.7625688777034,3338.7625688777034,3338.7625688777034,3338.7625688777034,"VAN",{"$f":"NPV($I$3,E5:E54)+E4","v":91522.077077984592},{"$f":"NPV($I$3,F5:F54)-F4","v":141156.55965875601},{"$f":"NPV($I$3,G5:G54)+G4","v":18453.807257613153}]
[6,3338.7625688777034,3338.7625688777034,3338.7625688777034,3338.7625688777034,3338.7625688777034,3338.7625688777034]
{"$rows_left_out":45}
{"sheet":"Calculo(rehabilitado)","index":4,"n_rows":109,"n_cols":17,"rows_kept":109,"cut":false,"hidden":true,"merged":[]}
[]
[null,"Emplazamiento",6]
[null,"Sup util","m2",{"$f":"DATOS!C6","v":636}]
[null,"Inercia termica","kJ/m2·K",200,{"$f":"IF(D4<=100,\"muy baja\",IF(D4<=150,\"baja\",IF(D4<400,\"alta\",IF(D4<=400,\"alta\",\"muy alta\"))))","v":"alta"}]
[null,"Renovación de aire","n (invierno)",{"$f":"DATOS!C38","v":2}]
[null,null,"n (verano)",5]
[null,"Altura plantas","m",{"$f":"DATOS!C7","v":3}]
["T.Consigna","Calefacción","ºC",19]
[null,"Refrigeración","ºC",26]
[null,"Ganacias Internas","W/m2",2.1]
{"$rows_left_out":100}
{"sheet":"Calculo(inicial)","index":5,"n_rows":109,"n_cols":17,"rows_kept":109,"cut":false,"hidden":true,"merged":[]}
[]
[null,"Emplazamiento",{"$f":"'Calculo(rehabilitado)'!C2","v":6}]
[null,"Sup util","m2",{"$f":"DATOS!C6","v":636}]
[null,"Inercia termica","kJ/m2·K",200,{"$f":"IF(D4<=100,\"muy baja\",IF(D4<=150,\"baja\",IF(D4<400,\"alta\",IF(D4<=400,\"alta\",\"muy alta\"))))","v":"alta"}]
[null,"Renovación de aire","n (invierno)",{"$f":"DATOS!C31","v":2}]
[null,null,"n (verano)",5]
[null,"Altura plantas","m",{"$f":"DATOS!C7","v":3}]
["T.Consigna","Calefacción","ºC",19]
[null,"Refrigeración","ºC",26]
[null,"Ganacias Internas","W/m2",2.1]
{"$rows_left_out":100}
{"sheet":"LOCALIDADES","index":6,"n_rows":59,"n_cols":74,"rows_kept":59,"cut":false,"hidden":true,"merged":[[0,49,0,60],[0,61,0,72],[0,1,0,12],[0,13,0,24],[0,25,0,36],[0,37,0,48]]}
[null,"TEMPERATURAS MEDIAS MENSUALES",null,null,null,null,null,null,null,null,null,null,null,"RADIACION SOLAR HORIZONTAL W/m2 dia",null,null,null,null,null,null,null,null,null,null,null,"RADIACION SOLAR SUR W/m2 dia",null,null,null,null,null,null,null,null,null,null,null,"RADIACION SOLAR SUR-OESTE/ SUR -ESTE W/m2 dia",null,null,null,null,null,null,null,null,null,null,null,"RADIACION SOLAR OESTE/ESTE W/m2 dia",null,null,null,null,null,null,null,null,null,null,null,"RADIACION SOLAR Norte W/m2 dia"]
[null,"Enero","Febrero","Marzo","Abril","Mayo","Junio","Julio","Agosto","Septiembre","Octubre","Noviembre","Diciembre","Enero","Febrero","Marzo","Abril","Mayo","Junio","Julio","Agosto","Septiembre","Octubre","Noviembre","Diciembre","Enero","Febrero","Marzo","Abril","Mayo","Junio","Julio","Agosto","Septiembre","Octubre","Noviembre","Diciembre","Enero","Febrero","Marzo","Abril","Mayo","Junio","Julio","Agosto","Septiembre","Octubre","Noviembre","Diciembre","Enero","Febrero","Marzo","Abril","Mayo","Junio","Julio","Agosto","Septiembre","Octubre","Noviembre","Diciembre","Enero","Febrero","Marzo","Abril","Mayo","Junio","Julio","Agosto","Septiembre","Octubre","Noviembre","Diciembre","Zona"]
["Albacete",4.2,5.6,9,11,15.3,21.6,24.1,23.8,17.8,13.7,8.6999999999999993,5.2,2010,2955,3433.333333333333,4876.666666666667,5454.4444444444443,6148.8888888888887,6636.6666666666661,5822.2222222222217,4536.1111111111113,3200,1882.7777777777778,1612.7777777777778,3201.3252387318466,3642.9968514266552,2852.7116614701717,2822.7380414398922,2445.3936838696973,2420.116611635443,2635.4660301858353,2944.6419548323033,3332.7710731940551,3494.7013194159499,2612.294147907844,2640.9846576759251,2545.6619424646888,3106.9432204656441,2784.3688571946077,3263.7000997698128,3114.6826634767303,3244.9758372084693,3592.618529357339,3649.8478148329391,3491.9272652990408,3097.9502974732677,2135.2255229253669,2082.5128913239678,1542.0152112951127,2173.9876262605776,2352.6414858313583,3209.6195858056726,3454.3794344126864,3838.7482701205131,4191.434748190356,3797.5576139133045,3098.2702042952646,2304.6060806777905,1393.478169363276,1234.0931216349288,627.27919731683244,871.16236886198908,1123.5072509994775,1481.8739721604002,1702.9208042038488,1826.674180240831,1798.4347851682719,1602.6461502947845,1296.346314430338,954.11165837700469,642.97606839467676,541.97181193222002,"D3"]
["Alicante",11,11.8,14,15.9,19,22.8,25.5,26.1,23.7,19.3,15.2,12,2594.4444444444443,3761.1111111111109,4512.2222222222217,5762.7777777777774,6588.8888888888887,7186.1111111111113,7246.6666666666661,6235,5145,3718.333333333333,2573.3333333333335,2083.8888888888887,4477.6198315034826,4948.1734123666047,3912.7029794223845,3268.1680113480411,2750.9350119675714,2591.3790202859113,2727.5581625418286,3073.7821372608028,3781.8394329395915,4173.1308421785998,3960.4025458937158,3706.9430760177097,3516.3528219339623,4178.2313467673212,3821.0025528281603,3871.8082142902872,3701.76446304007,3695.5025201768153,3860.873070590937,3881.5481957067118,3995.1707958048737,3687.073349029004,3182.1161578733577,2885.4225542457916,2045.3713430481625,2830.9361779235855,3156.6963392799926,3819.2620289618858,4192.6471376011104,4494.3701436217962,4576.3824302656949,4066.0627477578241,3533.2205615529465,2703.9821123022298,1971.1971237052283,1638.9995195436463,679.36317308056118,911.74218740277649,1207.9961802855248,1526.565487203552,1754.371406652032,1849.2789750916843,1796.1885471009905,1613.1218570881233,1323.4410729543638,993.96017744780727,722.88788037601978,602.67190697739454,"B4"]
["Almeria",11.7,11.8,14.1,16.100000000000001,18.399999999999999,22,24.7,25.3,23.4,19.399999999999999,15.6,12.8,2477.2222222222222,3373.333333333333,4650,5675.5555555555557,6501.1111111111113,6676.1111111111113,6815,6163.333333333333,4989.4444444444443,3827.2222222222222,2665.2900255903473,2128.3333333333335,3888.6153420724941,4030.2261940807689,3894.7178664000971,3112.2418789936273,2632.8511649665347,2409.8846922607531,2540.5125117998091,2939.4927984662299,3518.3114550262339,4124.1428350420647,3888.8888888868328,3527.9609792478877,3095.3290487908125,3459.43613394452,3840.4128736595576,3726.6767106145844,3590.2024363647961,3407.8439144938202,3588.0381859813433,3759.085996629954,3752.6257899956831,3674.569417474379,3149.8166608537135,2771.7967742469923,1881.9590760342783,2447.1740746627215,3213.1098869784682,3718.4353748255894,4102.5955335366989,4138.7054364748947,4262.8546407956956,3979.1156794574458,3371.9087309855072,2738.805301595241,1997.7501000943414,1627.5941176955905,706.55148432502779,937.60733373321273,1237.1031854184637,1538.782766198678,1754.5888846606358,1839.7302730418446,1797.3906268765879,1622.0214580498894,1342.898809846906,1027.2561806448646,758.68406988802337,634.81212373935614,"A4"]
["Avila",2.4,3.3,6.3,8.6999999999999993,12.2,16.399999999999999,20,19.8,16.3,10.6,6,3.2,1821.6666666666665,2831.6666666666665,3345.5555555555557,4516.666666666667,5476.666666666667,5898.8888888888887,6779.4444444444443,6295.5555555555557,4605,3076.6666666666665,1792.7777777777778,1390,3028.7093385914677,3663.407467634433,2881.9758629661801,2705.3567810288946,2531.1625818900793,2440.4781488744948,2775.5357597390448,3273.6257766087251,3533.3367871008459,3508.8454378927986,2633.8989884816879,2332.0734873445185,2394.9747706127482,3097.7695939069167,2787.764461857666,3070.8449692579757,3182.4885859740884,3179.4674493588063,3736.3029060329318,4051.911071970675,3664.7882820610916,3083.7573271390652,2133.7166964566559,1834.5128345996616,1423.8430585167389,2125.3800039878993,2323.9278703652776,2990.3648619438318,3498.3564859260027,3705.1470279329556,4323.6755071192911,4175.4106233744178,3199.8854351438031,2255.2380814242042,1357.1043354445362,1075.9329297908096,579.22348421074128,831.76611108976977,1093.3110018824673,1439.2567646952543,1703.0756761815528,1816.0870996342774,1801.3581698052076,1596.0132789498603,1276.5058203935585,916.56903700545922,606.94910809761643,486.05266390262386,"E1"]
["Badajoz",8.6,9.9,12.7,15.2,18,22.8,25.8,22.6,22.6,17.8,12.6,9.1,1821.1111111111111,2640,3652.7777777777778,4885.5555555555557,5907.2222222222217,6477.7777777777774,6640.5555555555557,5872.7777777777774,4582.2222222222217,3232.7777777777778,2186.6666666666665,1546.6666666666665,2755.4312280453487,3106.3819384977032,3066.1722115096322,2820.0673013717565,2582.2746833432752,2485.5998268688113,2628.2625901369188,2957.8060471518129,3360.4305234514063,3526.7870782778941,3217.2126916953557,2464.7831269801391,2208.8837540121522,2670.1509522231404,2992.4821619575882,3264.2326630059297,3356.9689779273194,3393.828908964917,3588.9982644105398,3676.0487898501133,3524.9197027006285,3127.4248276812368,2604.0486745378676,1951.6778131846056,1372.3216550518107,1910.1236018769862,2515.1057878078996,3212.987364385564,3751.5263275471184,4048.2729706043619,4191.1550998955181,3829.257056800875,3128.8903405439346,2327.0792300636949,1650.5742916631675,1172.3841380939034,607.00918220442702,844.58146045823412,1147.9665019996703,1483.5503555611056,1732.4837712120559,1840.8905194021208,1798.3549632118797,1604.8070683705585,1300.3874613078963,958.81772063967151,682.24232399477637,534.2282021203365,"C4"]
["Barcelona",8.4,10.1,11.7,14.1,17.5,19.899999999999999,23.1,23.6,20.8,17.8,12.9,10.6,2173.0555555555557,2823.8888888888887,3744.1666666666665,4805.5555555555557,5470,6162.5,6446.1111111111113,5550.5555555555557,4139.166666666667,3067.2222222222222,2152.7777777777778,1643.3333333333333,4040.3691061707218,3728.4741269437122,3362.4272918504757,2909.6358170175786,2554.1850075006382,2535.3312417810457,2717.717283393562,2959.7067820182979,3162.5730387867443,3560.559429373825,3527.1545224922147,3090.3766179782397,3145.4842403825851,3142.0314520210009,3235.636022202782,3311.4023848290753,3196.9073323799357,3326.2811359241805,3586.4704491103903,3575.5821246783912,3263.0001332126603,3119.0108208805896,2810.1284790601994,2392.5096036623149,1773.5662653947948,2137.5158324169529,2648.4005484233844,3209.2665258021671,3503.8089965265822,3886.9636073610145,4113.6491687193538,3662.6558364110774,2860.3442204251701,2264.7646433878776,1697.211285803276,1327.2171566373263,598.16220462491663,821.31034384203872,1123.3656464040096,1458.9131565349956,1701.9122357800402,1833.5023583393292,1795.9646191471902,1579.3241452375446,1243.6090909215425,906.6962094776261,637.99135198597662,511.56482151723338,"C2"]
["Bilbao",7.5,11.4,10.8,11.5,13.7,16.2,18.399999999999999,19.3,18.3,15.8,11.9,12.2,1056.6666666666667,1671.1111111111111,2451.1111111111109,2767.2222222222222,3767.2222222222222,3733.8888888888887,3919.4444444444443,3135,2978.3333333333335,2275,1222.2222222222222,845,1563.0585029709646,1940.8978933222566,2084.4340530490908,1714.2489657106337,1949.7060180963895,1836.142954554128,1947.1157683182287,1798.2444056023166,2252.2941081467243,2549.9774406230777,1714.4432879374654,1294.2776080586677,1260.5495938085123,1669.2981881008632,2002.8891397751474,1847.7891932141779,2253.8355042244411,2125.6320306936923,2274.621181699255,2000.2521113723687,2288.9416863024603,2241.6783790111663,1400.6582332222358,1034.6975036365329,795.79665253817086,1209.9309082145664,1688.4715313978038,1794.4801065324339,2390.053901170324,2328.482490198357,2467.7557107497805,2014.369878715597,2028.4403544039239,1660.2908025319325,914.04919797258685,636.32141721497817,420.12971527135704,641.44601507522907,932.79994680879543,1149.0723715850136,1478.4708958133854,1528.9663884223908,1536.6030873679251,1273.948107933682,1087.3541214120121,790.00513807701952,476.51054695051135,349.22777170618798,"C1"]
["Burgos",2.5,4.8,7.1,9.1999999999999993,12.2,16.2,19,18.8,16.2,11.3,6.5,3.4,1030,2221.1111111111109,2994.4444444444443,3996.1111111111109,5030.5555555555557,5953.8888888888887,6378.8888888888887,5577.7777777777774,4014.4444444444443,2787.2222222222222,1436.1111111111111,808.33333333333326,1428.1032197554193,2791.6620314701709,2620.0451057831924,2465.644918311215,2440.5515643837516,2535.4027155053482,2764.6043078539824,3044.6084950855125,3135.8129756257426,3256.3325338534096,2072.537843253197,1142.0056091914348,1163.8253720947541,2370.0324070297816,2517.2256913204278,2743.4955906554569,2979.1032456325224,3260.5344946738746,3597.345714797777,3649.7567111221156,3213.2999192106986,2846.5457028181295,1684.7781503631297,924.82310789101484,758.23001739043661,1653.0259603515294,2090.5478314591614,2651.4026125007658,3227.5413886765791,3771.0780081465036,4094.7264292681612,3711.9994874325357,2796.361088473745,2065.2952163698501,1083.2670560406125,592.35130050676833,421.6978123604286,742.95766776370567,1029.8780179570927,1370.1964637349301,1661.3360557962469,1823.890490211204,1794.4041885539311,1572.7666089495387,1220.0011621436536,864.38690563426701,528.47953716653353,346.11682872359944,"E1"]
{"$rows_left_out":50}
{"sheet":"LIMITES","index":7,"n_rows":52,"n_cols":12,"rows_kept":52,"cut":false,"hidden":true,"merged":[]}
[]
["INICIAL"]
["Epoca","Valor Uo Muros","Valor Uo Cubiertas","Valor Uo huecos","Tasa ventilacion","F.solar",null,null,"Hermeticidad",null,null,"Refrigeracion"]
["Antes de 1979",1.8,2.5,5.7,2,0.75,"Sin rehabilitacion",null,"Sin Modificación",null,null,"Si"]
["Entre 1979 y 2006",1.4,1.8,4.5,1.5,0.75,"Rehab.\"mínima\"",null,"Hermeticidad mejorada",0.75,null,"No"]
[null,null,null,null,null,null,"Rehab. \"estándard\"",null,"Hermeticidad muy buena",0.5]
["Rehabilitacion Opacos",null,null,null,null,null,"Rehab. \"elevada\"",null,"PT"]
[null,"Muros",null,null,null,"Cubiertas",null,null,"Sin Modificación",1.3]
["Zona ","Rehab.\"basica\"","Rehab. \"media\"","Rehab. \"elevada\"","Zona ","Rehab.\"basica\"","Rehab. \"media\"","Rehab. \"elevada\"","Puentes térmicos reducidos",1.1499999999999999]
["A",0.7,0.5,0.15,"A",0.5,0.44,0.15,"Puentes termicos eliminados",1.05]
{"$rows_left_out":42}